openSuSE
Username:
Password:
Linki sponsorowane: | inwestycje | erasmus in warsaw
Strony: [1]
  Drukuj  
Autor Wątek: WineCVS  (Przeczytany 16355 razy)
0 użytkowników i 1 Gość przegląda ten wątek.
amaroKer
Super Moderator
*
Offline Offline

Płeć: Mężczyzna
Wiadomości: 395



« : Luty 24, 2007, 11:42:33 »

Mam problem z aplikacja WineCVS. Podczas "make" wyskakują mi errory i opuszczanie katalogow. Mam "make", "gcc" "glib". Co mam zrobić Co? Znalazlem opis instalacji na    http://gry.linux.pl/?id=article&show=310     Tam jest wytlumaczone bardzo dobrze tylko ze nie ma nic o problemach jakie moga sie pojawic. Czy moze to problem z kompilatorem? Mam OpenSuSE 10.2 P4 3GH, Ati Radeon 9600, 256MB RAM-u. gg-1528410. Bede wdziaczny za pomoc.
Zapisane
susek.info
Admin
*
Offline Offline

Wiadomości: 453



« Odpowiedz #1 : Luty 24, 2007, 12:11:10 »

wklej co wypluwa ci make
Zapisane
amaroKer
Super Moderator
*
Offline Offline

Płeć: Mężczyzna
Wiadomości: 395



« Odpowiedz #2 : Luty 24, 2007, 13:46:37 »

Compiling ...
--------- Error log - file /home/Filip/.WineCVS/sources/cvscedega/ErrorLog : ---------
./ppl.l:1368: error: ‘DEBUGLEVEL_PPLEX’ undeclared (first use in this function)
./ppl.l:1370: error: ‘input_name’ undeclared (first use in this function)
./ppl.l:1371: error: ‘line_number’ undeclared (first use in this function)
./ppl.l:1378: error: ‘pp_macexp’ undeclared (first use in this function)
./ppl.l:1379: warning: implicit declaration of function ‘push_buffer’
./ppl.l: In function ‘macro_add_expansion’:
./ppl.l:1387: error: ‘macexpstackentry_t’ undeclared (first use in this function)
./ppl.l:1387: error: ‘mep’ undeclared (first use in this function)
./ppl.l:1396: error: ‘debuglevel’ undeclared (first use in this function)
./ppl.l:1396: error: ‘DEBUGLEVEL_PPLEX’ undeclared (first use in this function)
./ppl.l:1398: error: ‘input_name’ undeclared (first use in this function)
./ppl.l:1399: error: ‘line_number’ undeclared (first use in this function)
./ppl.l: At top level:
./ppl.l:1411: warning: conflicting types for ‘put_buffer’
./ppl.l:1411: error: static declaration of ‘put_buffer’ follows non-static declaration
./ppl.l:476: error: previous implicit declaration of ‘put_buffer’ was here
./ppl.l: In function ‘put_buffer’:
./ppl.l:1415: error: ‘pass_data’ undeclared (first use in this function)
./ppl.l: In function ‘do_include’:
./ppl.l:1439: error: ‘includelogicentry_t’ undeclared (first use in this function)
./ppl.l:1439: error: ‘iep’ undeclared (first use in this function)
./ppl.l:1441: error: ‘includelogiclist’ undeclared (first use in this function)
./ppl.l:1462: warning: implicit declaration of function ‘open_include’
./ppl.l:1462: warning: assignment makes pointer from integer without a cast
./ppl.l:1467: error: ‘seen_junk’ undeclared (first use in this function)
./ppl.l:1468: error: ‘include_state’ undeclared (first use in this function)
./ppl.l:1469: error: ‘include_ppp’ undeclared (first use in this function)
./ppl.l:1470: error: ‘pass_data’ undeclared (first use in this function)
./ppl.l:1473: error: ‘debuglevel’ undeclared (first use in this function)
./ppl.l:1473: error: ‘DEBUGLEVEL_PPMSG’ undeclared (first use in this function)
./ppl.l:1474: error: ‘input_name’ undeclared (first use in this function)
./ppl.l:1474: error: ‘line_number’ undeclared (first use in this function)
./ppl.l:1474: error: ‘include_ifdepth’ undeclared (first use in this function)
./ppl.l: In function ‘push_ignore_state’:
./ppl.l:1488: error: ‘pp_ignore’ undeclared (first use in this function)
make[2]: *** [lex.ppl.o] Błąd 1
bison -y *** Oczekiwanie na niezakończone zadania....
flex  -t parser.l >parser.yy.c || (rm -f parser.yy.c && exit 1)
make[2]: Opuszczenie katalogu `/home/Filip/.WineCVS/sources/cvscedega/winex/tools/wrc'
make[1]: *** [wrc] Błąd 2
make[1]: *** Oczekiwanie na niezakończone zadania....
konflikty: 12 przesunięcie/redukcja
bison -y  -p parser_ -o parser.tab.c parser.y
gcc -MMD -c  -I. -I. -I../../include -I../../include  -g -O2 -Wall -mpreferred-stack-boundary=2 -fno-keep-static-consts -D__const=const -fno-strict-aliasing -Wa,--execstack -D__int8=char -D__int16=short -D__int32=int "-D__int64=long long"  -D_REENTRANT  -o parser.yy.o parser.yy.c
konflikty: 12 przesunięcie/redukcja
gcc -MMD -c  -I. -I. -I../../include -I../../include  -g -O2 -Wall -mpreferred-stack-boundary=2 -fno-keep-static-consts -D__const=const -fno-strict-aliasing -Wa,--execstack -D__int8=char -D__int16=short -D__int32=int "-D__int64=long long"  -D_REENTRANT  -o parser.tab.o parser.tab.c
gcc -g -O2 -Wall -mpreferred-stack-boundary=2 -fno-keep-static-consts -D__const=const -fno-strict-aliasing -Wa,--execstack -D__int8=char -D__int16=short -D__int32=int "-D__int64=long long" -o widl  client.o hash.o header.o proxy.o server.o typegen.o typelib.o utils.o widl.o write_msft.o     parser.tab.o parser.yy.o  ../../libs/wpp/libwpp.a -L../../port -lwine_port -lfl
make[2]: Opuszczenie katalogu `/home/Filip/.WineCVS/sources/cvscedega/winex/tools/widl'
make[1]: Opuszczenie katalogu `/home/Filip/.WineCVS/sources/cvscedega/winex/tools'
make: *** [tools] Błąd 2
Error in Make
Try fixing the error based on the output above, and
run the script again, without paramaters (Eg: WineCVS.sh)
Zapisane
muszka
*
Offline Offline

Płeć: Mężczyzna
Wiadomości: 103



« Odpowiedz #3 : Luty 28, 2007, 14:43:16 »

Kompilujesz to jako user czy jako root?
Zapisane
amaroKer
Super Moderator
*
Offline Offline

Płeć: Mężczyzna
Wiadomości: 395



« Odpowiedz #4 : Marzec 02, 2007, 19:17:49 »

oczywiscie ze jako root
Zapisane
Strony: [1]
  Drukuj  
 
Skocz do:  

erasmus - serwis komputerowy lubin - projektowanie stron lubin - cuprum lubin - projektowanie stron - zaproszenia lockerz - notatki studenckie
Template modified by designworld.pl